Reaction Details
TargetSterol O-acyltransferase 2
LigandBDBM50436347
Substrate/Competitorn/a
Meas. Tech.ChEMBL_966605 (CHEMBL2399639)
IC50 6.6±n/a nM
Citation Ohtawa, MYamazaki, HOhte, SMatsuda, DOhshiro, TRudel, LLOmura, STomoda, HNagamitsu, T Synthesis and structure-activity relationship of pyripyropene A derivatives as potent and selective acyl-CoA:cholesterol acyltransferase 2 (ACAT2) inhibitors: part 3. Bioorg Med Chem Lett23:3798-801 (2013) 
 
Sterol O-acyltransferase 2
Name:Sterol O-acyltransferase 2
Type:Enzyme
Mol. Mass.:59912.75
Organism:Homo sapiens (Human)
Description:O75908
Residue:522
BDBM50436347
NameBDBM50436347
Synonyms:CHEMBL2398812
TypeSmall organic molecule
Emp. Form.C42H42N2O8
Mol. Mass.702.7915
SMILESCc1ccc([C@@H]2OC[C@]3(C)[C@H](CC[C@@]4(C)[C@H]3C[C@H](OC(=O)c3ccc(cc3)C#N)[C@@]3(C)Oc5cc(oc(=O)c5[C@H](O)[C@H]43)-c3cccnc3)O2)c(C)c1