Reaction Details
TargetFatty-acid amide hydrolase 1 [30-579]
LigandBDBM50436356
Substrate/Competitorn/a
Meas. Tech.ChEMBL_966782 (CHEMBL2400482)
IC50 0.813000±n/a nM
Citation Sadovski, OHicks, JWParkes, JRaymond, RNobrega, JHoule, SCipriano, MFowler, CJVasdev, NWilson, AA Development and characterization of a promising fluorine-18 labelled radiopharmaceutical for in vivo imaging of fatty acid amide hydrolase. Bioorg Med Chem21:4351-7 (2013) 
 
Fatty-acid amide hydrolase 1 [30-579]
Name:Fatty-acid amide hydrolase 1 [30-579]
Type:Single-pass membrane protein; homodimer
Mol. Mass.:60474.00
Organism:Rattus norvegicus (rat)
Description:P97612 (aa 30-579)
Residue:550
BDBM50436356
NameBDBM50436356
Synonyms:CHEMBL2396702
TypeSmall organic molecule
Emp. Form.C15H19FN2O3
Mol. Mass.294.3214
SMILESFCCCCCNC(=O)Oc1cccc(c1)C1=NCCO1