Reaction Details
TargetTyrosine-protein phosphatase non-receptor type 22
LigandBDBM50436366
Substrate/Competitorn/a
Meas. Tech.ChEMBL_966913 (CHEMBL2401204)
IC50 2100±n/a nM
Citation He, YLiu, SMenon, AStanford, SOppong, EGunawan, AMWu, LWu, DJBarrios, AMBottini, NCato, ACZhang, ZY A potent and selective small-molecule inhibitor for the lymphoid-specific tyrosine phosphatase (LYP), a target associated with autoimmune diseases. J Med Chem56:4990-5008 (2013) 
 
Tyrosine-protein phosphatase non-receptor type 22
Name:Tyrosine-protein phosphatase non-receptor type 22
Type:n/a
Mol. Mass.:91712.31
Organism:Homo sapiens (Human)
Description:Q9Y2R2
Residue:807
BDBM50436366
NameBDBM50436366
Synonyms:CHEMBL2396715
TypeSmall organic molecule
Emp. Form.C22H11F3O5S
Mol. Mass.444.38
SMILESOC(=O)c1cc2c(C#Cc3ccsc3)c(oc2cc1O)-c1ccc(OC(F)(F)F)cc1