Reaction Details
TargetTyrosine-protein phosphatase non-receptor type 22
LigandBDBM50425819
Substrate/Competitorn/a
Meas. Tech.ChEMBL_966913 (CHEMBL2401204)
IC50 3900±n/a nM
Citation He, YLiu, SMenon, AStanford, SOppong, EGunawan, AMWu, LWu, DJBarrios, AMBottini, NCato, ACZhang, ZY A potent and selective small-molecule inhibitor for the lymphoid-specific tyrosine phosphatase (LYP), a target associated with autoimmune diseases. J Med Chem56:4990-5008 (2013) 
 
Tyrosine-protein phosphatase non-receptor type 22
Name:Tyrosine-protein phosphatase non-receptor type 22
Type:n/a
Mol. Mass.:91712.31
Organism:Homo sapiens (Human)
Description:Q9Y2R2
Residue:807
BDBM50425819
NameBDBM50425819
Synonyms:CHEMBL2316904
TypeSmall organic molecule
Emp. Form.C23H13FO4
Mol. Mass.372.3453
SMILESOC(=O)c1cc2c(C#Cc3cccc(F)c3)c(oc2cc1O)-c1ccccc1