Reaction Details
TargetTyrosine-protein phosphatase non-receptor type 22
LigandBDBM50436368
Substrate/Competitorn/a
Meas. Tech.ChEMBL_966983 (CHEMBL2401470)
IC50 680±n/a nM
Citation He, YLiu, SMenon, AStanford, SOppong, EGunawan, AMWu, LWu, DJBarrios, AMBottini, NCato, ACZhang, ZY A potent and selective small-molecule inhibitor for the lymphoid-specific tyrosine phosphatase (LYP), a target associated with autoimmune diseases. J Med Chem56:4990-5008 (2013) 
 
Tyrosine-protein phosphatase non-receptor type 22
Name:Tyrosine-protein phosphatase non-receptor type 22
Type:n/a
Mol. Mass.:91712.31
Organism:Homo sapiens (Human)
Description:Q9Y2R2
Residue:807
BDBM50436368
NameBDBM50436368
Synonyms:CHEMBL2396713
TypeSmall organic molecule
Emp. Form.C24H12ClF3O5
Mol. Mass.472.797
SMILESOC(=O)c1cc2c(C#Cc3cccc(Cl)c3)c(oc2cc1O)-c1ccc(OC(F)(F)F)cc1