Reaction Details
TargetTyrosine-protein phosphatase non-receptor type 22
LigandBDBM50436375
Substrate/Competitorn/a
Meas. Tech.ChEMBL_966983 (CHEMBL2401470)
IC50 15000±n/a nM
Citation He, YLiu, SMenon, AStanford, SOppong, EGunawan, AMWu, LWu, DJBarrios, AMBottini, NCato, ACZhang, ZY A potent and selective small-molecule inhibitor for the lymphoid-specific tyrosine phosphatase (LYP), a target associated with autoimmune diseases. J Med Chem56:4990-5008 (2013) 
 
Tyrosine-protein phosphatase non-receptor type 22
Name:Tyrosine-protein phosphatase non-receptor type 22
Type:n/a
Mol. Mass.:91712.31
Organism:Homo sapiens (Human)
Description:Q9Y2R2
Residue:807
BDBM50436375
NameBDBM50436375
Synonyms:CHEMBL2396725
TypeSmall organic molecule
Emp. Form.C25H15ClO7
Mol. Mass.462.835
SMILESOC(=O)COc1cccc(c1)-c1oc2cc(O)c(cc2c1C#Cc1cccc(Cl)c1)C(O)=O