Reaction Details
TargetOrexin receptor type 2
LigandBDBM50436376
Substrate/Competitorn/a
Meas. Tech.ChEMBL_967231 (CHEMBL2400168)
IC50 2.0±n/a nM
Citation Sifferlen, TKoberstein, RCottreel, EBoller, AWeller, TGatfield, JBrisbare-Roch, CJenck, FBoss, C Structure-activity relationship studies and sleep-promoting activity of novel 1-chloro-5,6,7,8-tetrahydroimidazo[1,5-a]pyrazine derivatives as dual orexin receptor antagonists. Part 2. Bioorg Med Chem Lett23:3857-63 (2013) 
 
Orexin receptor type 2
Name:Orexin receptor type 2
Type:Protein
Mol. Mass.:50710.53
Organism:Homo sapiens (Human)
Description:O43614
Residue:444
BDBM50436376
NameBDBM50436376
Synonyms:CHEMBL2396842
TypeSmall organic molecule
Emp. Form.C27H28ClF3N4O2
Mol. Mass.532.985
SMILESCNC(=O)[C@H](N1CCn2c(nc(Cl)c2[C@@H]1CCc1ccc(OC(F)F)c(F)c1)C1CC1)c1ccccc1