Reaction Details
TargetCytochrome P450 3A4
LigandBDBM50436481
Substrate/Competitorn/a
Meas. Tech.ChEMBL_966467 (CHEMBL2399055)
IC50 710±n/a nM
Citation Décor, AGrand-Maître, CHucke, OO'Meara, JKuhn, CConstantineau-Forget, LBrochu, CMalenfant, EBertrand-Laperle, MBordeleau, JGhiro, EPesant, MFazal, GGorys, VLittle, MBoucher, CBordeleau, STurcotte, PGuo, TGarneau, MSpickler, CGauthier, A Design, synthesis and biological evaluation of novel aminothiazoles as antiviral compounds acting against human rhinovirus. Bioorg Med Chem Lett23:3841-7 (2013) 
 
Cytochrome P450 3A4
Name:Cytochrome P450 3A4
Type:Enzyme
Mol. Mass.:57349.57
Organism:Homo sapiens (Human)
Description:n/a
Residue:503
BDBM50436481
NameBDBM50436481
Synonyms:CHEMBL2397305
TypeSmall organic molecule
Emp. Form.C24H22N6O2S
Mol. Mass.458.535
SMILESCc1nc(NC(=O)CN(Cc2ccccc2)C(=O)c2ccncc2)sc1-c1ccc(N)nc1