Reaction Details
TargetPhosphatidylinositol 4,5-bisphosphate 3-kinase catalytic subunit delta isoform
LigandBDBM50436477
Substrate/Competitorn/a
Meas. Tech.ChEMBL_966448 (CHEMBL2399036)
IC50 11000±n/a nM
Citation Décor, AGrand-Maître, CHucke, OO'Meara, JKuhn, CConstantineau-Forget, LBrochu, CMalenfant, EBertrand-Laperle, MBordeleau, JGhiro, EPesant, MFazal, GGorys, VLittle, MBoucher, CBordeleau, STurcotte, PGuo, TGarneau, MSpickler, CGauthier, A Design, synthesis and biological evaluation of novel aminothiazoles as antiviral compounds acting against human rhinovirus. Bioorg Med Chem Lett23:3841-7 (2013) 
 
Phosphatidylinositol 4,5-bisphosphate 3-kinase catalytic subunit delta isoform
Name:Phosphatidylinositol 4,5-bisphosphate 3-kinase catalytic subunit delta isoform
Type:Enzyme Subunit
Mol. Mass.:119489.41
Organism:Homo sapiens (Human)
Description:O00329
Residue:1044
BDBM50436477
NameBDBM50436477
Synonyms:CHEMBL2397315
TypeSmall organic molecule
Emp. Form.C14H15F3N4OS
Mol. Mass.344.355
SMILESC[C@@H](CC(F)(F)F)C(=O)Nc1nc(C)c(s1)-c1ccc(N)nc1