Reaction Details
TargetD(2) dopamine receptor
LigandBDBM50436534
Substrate/Competitorn/a
Meas. Tech.ChEMBL_966657 (CHEMBL2399862)
Ki 43±n/a nM
Citation Reinart-Okugbeni, RVonk, AUustare, AGyulai, ZSipos, ARinken, A 1-substituted apomorphines as potent dopamine agonists. Bioorg Med Chem21:4143-50 (2013) 
 
D(2) dopamine receptor
Name:D(2) dopamine receptor
Type:Cell-surface receptors
Mol. Mass.:50647.10
Organism:Homo sapiens (Human)
Description:P14416
Residue:443
BDBM50436534
NameBDBM50436534
Synonyms:CHEMBL2397382
TypeSmall organic molecule
Emp. Form.C18H19NO3
Mol. Mass.297.3484
SMILESCN1CCc2ccc(CO)c-3c2[C@H]1Cc1ccc(O)c(O)c-31