Reaction Details
TargetSerine/threonine-protein kinase pim-1
LigandBDBM50436562
Substrate/Competitorn/a
Meas. Tech.ChEMBL_966960 (CHEMBL2401345)
IC50 200±n/a nM
Citation Suchaud, VGavara, LSaugues, ENauton, LThéry, VAnizon, FMoreau, P Identification of 1,6-dihydropyrazolo[4,3-c]carbazoles and 3,6-dihydropyrazolo[3,4-c]carbazoles as new Pim kinase inhibitors. Bioorg Med Chem21:4102-11 (2013) 
 
Serine/threonine-protein kinase pim-1
Name:Serine/threonine-protein kinase pim-1
Type:Protein
Mol. Mass.:35681.82
Organism:Homo sapiens (Human)
Description:P11309
Residue:313
BDBM50436562
NameBDBM50436562
Synonyms:CHEMBL2397525
TypeSmall organic molecule
Emp. Form.C13H7ClN4O2
Mol. Mass.286.673
SMILES[O-][N+](=O)c1cc2n[nH]cc2c2c1[nH]c1ccc(Cl)cc21