Reaction Details
TargetSerine/threonine-protein kinase pim-1
LigandBDBM50436565
Substrate/Competitorn/a
Meas. Tech.ChEMBL_966960 (CHEMBL2401345)
IC50 220±n/a nM
Citation Suchaud, VGavara, LSaugues, ENauton, LThéry, VAnizon, FMoreau, P Identification of 1,6-dihydropyrazolo[4,3-c]carbazoles and 3,6-dihydropyrazolo[3,4-c]carbazoles as new Pim kinase inhibitors. Bioorg Med Chem21:4102-11 (2013) 
 
Serine/threonine-protein kinase pim-1
Name:Serine/threonine-protein kinase pim-1
Type:Protein
Mol. Mass.:35681.82
Organism:Homo sapiens (Human)
Description:P11309
Residue:313
BDBM50436565
NameBDBM50436565
Synonyms:CHEMBL2397599
TypeSmall organic molecule
Emp. Form.C14H10N4O3
Mol. Mass.282.2542
SMILESCOc1ccc2[nH]c3c(cc4c[nH]nc4c3c2c1)[N+]([O-])=O