Reaction Details
TargetSerine/threonine-protein kinase pim-3
LigandBDBM50436562
Substrate/Competitorn/a
Meas. Tech.ChEMBL_966955 (CHEMBL2401340)
IC50 230±n/a nM
Citation Suchaud, VGavara, LSaugues, ENauton, LThéry, VAnizon, FMoreau, P Identification of 1,6-dihydropyrazolo[4,3-c]carbazoles and 3,6-dihydropyrazolo[3,4-c]carbazoles as new Pim kinase inhibitors. Bioorg Med Chem21:4102-11 (2013) 
 
Serine/threonine-protein kinase pim-3
Name:Serine/threonine-protein kinase pim-3
Type:Protein
Mol. Mass.:35888.19
Organism:Homo sapiens (Human)
Description:Q86V86
Residue:326
BDBM50436562
NameBDBM50436562
Synonyms:CHEMBL2397525
TypeSmall organic molecule
Emp. Form.C13H7ClN4O2
Mol. Mass.286.673
SMILES[O-][N+](=O)c1cc2n[nH]cc2c2c1[nH]c1ccc(Cl)cc21