Reaction Details
TargetTyrosine-protein kinase ABL1
LigandBDBM50436580
Substrate/Competitorn/a
Meas. Tech.ChEMBL_967169 (CHEMBL2399913)
Ki 140±n/a nM
Citation Radi, MTintori, CMusumeci, FBrullo, CZamperini, CDreassi, EFallacara, ALVignaroli, GCrespan, EZanoli, SLaurenzana, IFilippi, IMaga, GSchenone, SAngelucci, ABotta, M Design, synthesis, and biological evaluation of pyrazolo[3,4-d]pyrimidines active in vivo on the Bcr-Abl T315I mutant. J Med Chem56:5382-94 (2014) 
 
Tyrosine-protein kinase ABL1
Name:Tyrosine-protein kinase ABL1
Type:Enzyme
Mol. Mass.:122897.30
Organism:Homo sapiens (Human)
Description:P00519
Residue:1130
BDBM50436580
NameBDBM50436580
Synonyms:CHEMBL2397806
TypeSmall organic molecule
Emp. Form.C20H16BrCl2N5
Mol. Mass.477.185
SMILESClC(Cn1ncc2c(NCc3ccc(Cl)cc3)ncnc12)c1ccc(Br)cc1