Reaction Details
TargetTyrosine-protein kinase ABL1
LigandBDBM50436586
Substrate/Competitorn/a
Meas. Tech.ChEMBL_967169 (CHEMBL2399913)
Ki 1440±n/a nM
Citation Radi, MTintori, CMusumeci, FBrullo, CZamperini, CDreassi, EFallacara, ALVignaroli, GCrespan, EZanoli, SLaurenzana, IFilippi, IMaga, GSchenone, SAngelucci, ABotta, M Design, synthesis, and biological evaluation of pyrazolo[3,4-d]pyrimidines active in vivo on the Bcr-Abl T315I mutant. J Med Chem56:5382-94 (2014) 
 
Tyrosine-protein kinase ABL1
Name:Tyrosine-protein kinase ABL1
Type:Enzyme
Mol. Mass.:122897.30
Organism:Homo sapiens (Human)
Description:P00519
Residue:1130
BDBM50436586
NameBDBM50436586
Synonyms:CHEMBL2397800
TypeSmall organic molecule
Emp. Form.C19H15ClFN5
Mol. Mass.367.807
SMILESFc1cccc(Nc2ncnc3n(CC(Cl)c4ccccc4)ncc23)c1