Reaction Details
TargetTyrosine-protein kinase ABL1
LigandBDBM50343424
Substrate/Competitorn/a
Meas. Tech.ChEMBL_967169 (CHEMBL2399913)
Ki 80±n/a nM
Citation Radi, MTintori, CMusumeci, FBrullo, CZamperini, CDreassi, EFallacara, ALVignaroli, GCrespan, EZanoli, SLaurenzana, IFilippi, IMaga, GSchenone, SAngelucci, ABotta, M Design, synthesis, and biological evaluation of pyrazolo[3,4-d]pyrimidines active in vivo on the Bcr-Abl T315I mutant. J Med Chem56:5382-94 (2014) 
 
Tyrosine-protein kinase ABL1
Name:Tyrosine-protein kinase ABL1
Type:Enzyme
Mol. Mass.:122897.30
Organism:Homo sapiens (Human)
Description:P00519
Residue:1130
BDBM50343424
NameBDBM50343424
Synonyms:1-(2-chloro-2-(4-chlorophenyl)ethyl)-N-(4-fluorobenzyl)-1H-pyrazolo[3,4-d]pyrimidin-4-amine CHEMBL406658
TypeSmall organic molecule
Emp. Form.C20H16Cl2FN5
Mol. Mass.416.279
SMILESFc1ccc(CNc2ncnc3n(CC(Cl)c4ccc(Cl)cc4)ncc23)cc1