Reaction Details
TargetAurora kinase A
LigandBDBM50436690
Substrate/Competitorn/a
Meas. Tech.ChEMBL_966729 (CHEMBL2400289)
IC50 61±n/a nM
Citation Shiao, HYCoumar, MSChang, CWKe, YYChi, YHChu, CYSun, HYChen, CHLin, WHFung, KSKuo, PCHuang, CTChang, KYLu, CTHsu, JTChen, CTJiaang, WTChao, YSHsieh, HP Optimization of ligand and lipophilic efficiency to identify an in vivo active furano-pyrimidine Aurora kinase inhibitor. J Med Chem56:5247-60 (2014) 
 
Aurora kinase A
Name:Aurora kinase A
Type:Serine/threonine-protein kinase
Mol. Mass.:45830.98
Organism:Homo sapiens (Human)
Description:O14965
Residue:403
BDBM50436690
NameBDBM50436690
Synonyms:CHEMBL2398643
TypeSmall organic molecule
Emp. Form.C32H34N6O3
Mol. Mass.550.6508
SMILESCN(C)CCCOc1ccc(cc1)-c1cc2c(NCCc3ccc(NC(=O)Nc4ccccc4)cc3)ncnc2o1