Reaction Details
TargetAurora kinase A
LigandBDBM50436699
Substrate/Competitorn/a
Meas. Tech.ChEMBL_966729 (CHEMBL2400289)
IC50 929±n/a nM
Citation Shiao, HYCoumar, MSChang, CWKe, YYChi, YHChu, CYSun, HYChen, CHLin, WHFung, KSKuo, PCHuang, CTChang, KYLu, CTHsu, JTChen, CTJiaang, WTChao, YSHsieh, HP Optimization of ligand and lipophilic efficiency to identify an in vivo active furano-pyrimidine Aurora kinase inhibitor. J Med Chem56:5247-60 (2014) 
 
Aurora kinase A
Name:Aurora kinase A
Type:Serine/threonine-protein kinase
Mol. Mass.:45830.98
Organism:Homo sapiens (Human)
Description:O14965
Residue:403
BDBM50436699
NameBDBM50436699
Synonyms:CHEMBL2398650
TypeSmall organic molecule
Emp. Form.C27H23N5O2
Mol. Mass.449.5038
SMILESNC(=O)Nc1ccc(CCNc2ncnc3oc(c(-c4ccccc4)c23)-c2ccccc2)cc1