Reaction Details
TargetAurora kinase A
LigandBDBM50436709
Substrate/Competitorn/a
Meas. Tech.ChEMBL_966729 (CHEMBL2400289)
IC50 123±n/a nM
Citation Shiao, HYCoumar, MSChang, CWKe, YYChi, YHChu, CYSun, HYChen, CHLin, WHFung, KSKuo, PCHuang, CTChang, KYLu, CTHsu, JTChen, CTJiaang, WTChao, YSHsieh, HP Optimization of ligand and lipophilic efficiency to identify an in vivo active furano-pyrimidine Aurora kinase inhibitor. J Med Chem56:5247-60 (2014) 
 
Aurora kinase A
Name:Aurora kinase A
Type:Serine/threonine-protein kinase
Mol. Mass.:45830.98
Organism:Homo sapiens (Human)
Description:O14965
Residue:403
BDBM50436709
NameBDBM50436709
Synonyms:CHEMBL2398654
TypeSmall organic molecule
Emp. Form.C33H26FN5O2
Mol. Mass.543.5902
SMILESFc1ccc(NC(=O)Nc2ccc(CCNc3ncnc4oc(c(-c5ccccc5)c34)-c3ccccc3)cc2)cc1