Reaction Details
TargetHistamine H1 receptor
LigandBDBM50292604
Substrate/Competitorn/a
Meas. Tech.ChEMBL_969176 (CHEMBL2404433)
Ki 430±n/a nM
Citation Darvesh, SMacdonald, IRMartin, E Selectivity of phenothiazine cholinesterase inhibitors for neurotransmitter systems. Bioorg Med Chem Lett23:3822-5 (2013) 
 
Histamine H1 receptor
Name:Histamine H1 receptor
Type:G Protein-Coupled Receptor (GPCR)
Mol. Mass.:55808.72
Organism:Homo sapiens (Human)
Description:Cell pellets from SK-N-MC cells transfected with human H1 receptor were used in binding assay.
Residue:487
BDBM50292604
NameBDBM50292604
Synonyms:3-(diethylamino)propyl 10H-phenothiazine-10-carboxylate | CHEMBL519609
TypeSmall organic molecule
Emp. Form.C20H24N2O2S
Mol. Mass.356.482
SMILESCCN(CC)CCCOC(=O)N1c2ccccc2Sc2ccccc12