Reaction Details
TargetALK tyrosine kinase receptor
LigandBDBM50436854
Substrate/Competitorn/a
Meas. Tech.ChEMBL_971487 (CHEMBL2406365)
IC50 29±n/a nM
Citation Marsilje, THPei, WChen, BLu, WUno, TJin, YJiang, TKim, SLi, NWarmuth, MSarkisova, YSun, FSteffy, APferdekamper, ACLi, AGJoseph, SBKim, YLiu, BTuntland, TCui, XGray, NSSteensma, RWan, YJiang, JChopiuk, GLi, JGordon, WPRichmond, WJohnson, KChang, JGroessl, THe, YQPhimister, AAycinena, ALee, CCBursulaya, BKaranewsky, DSSeidel, HMHarris, JLMichellys, PY Synthesis, structure-activity relationships, and in vivo efficacy of the novel potent and selective anaplastic lymphoma kinase (ALK) inhibitor 5-chloro-N2-(2-isopropoxy-5-methyl-4-(piperidin-4-yl)phenyl)-N4-(2-(isopropylsulfonyl)phenyl)pyrimidine-2,4-diamine (LDK378) currently in phase 1 and phase  J Med Chem56:5675-90 (2014) 
 
ALK tyrosine kinase receptor
Name:ALK tyrosine kinase receptor
Type:Protein
Mol. Mass.:176453.10
Organism:Homo sapiens (Human)
Description:Q9UM73
Residue:1620
BDBM50436854
NameBDBM50436854
Synonyms:CHEMBL2403827
TypeSmall organic molecule
Emp. Form.C31H43N5O3S
Mol. Mass.565.77
SMILESCCN1CCC(CC1)c1cc(OC(C)C)c(Nc2ncc(C)c(Nc3ccccc3S(=O)(=O)C(C)C)n2)cc1C