Reaction Details
TargetInsulin receptor
LigandBDBM50436869
Substrate/Competitorn/a
Meas. Tech.ChEMBL_971485 (CHEMBL2406363)
IC50 542±n/a nM
Citation Marsilje, THPei, WChen, BLu, WUno, TJin, YJiang, TKim, SLi, NWarmuth, MSarkisova, YSun, FSteffy, APferdekamper, ACLi, AGJoseph, SBKim, YLiu, BTuntland, TCui, XGray, NSSteensma, RWan, YJiang, JChopiuk, GLi, JGordon, WPRichmond, WJohnson, KChang, JGroessl, THe, YQPhimister, AAycinena, ALee, CCBursulaya, BKaranewsky, DSSeidel, HMHarris, JLMichellys, PY Synthesis, structure-activity relationships, and in vivo efficacy of the novel potent and selective anaplastic lymphoma kinase (ALK) inhibitor 5-chloro-N2-(2-isopropoxy-5-methyl-4-(piperidin-4-yl)phenyl)-N4-(2-(isopropylsulfonyl)phenyl)pyrimidine-2,4-diamine (LDK378) currently in phase 1 and phase  J Med Chem56:5675-90 (2014) 
 
Insulin receptor
Name:Insulin receptor
Type:Receptor Tyrosine Kinase
Mol. Mass.:156322.60
Organism:Homo sapiens (Human)
Description:P06213
Residue:1382
BDBM50436869
NameBDBM50436869
Synonyms:CHEMBL2403846
TypeSmall organic molecule
Emp. Form.C29H39N5O3S
Mol. Mass.537.717
SMILESCC(C)Oc1cc(C2CCNCC2)c(C)cc1Nc1ncc(C)c(Nc2ccccc2S(=O)(=O)C(C)C)n1