Reaction Details
TargetHigh affinity nerve growth factor receptor
LigandBDBM50436850
Substrate/Competitorn/a
Meas. Tech.ChEMBL_971281 (CHEMBL2405536)
IC50 2727±n/a nM
Citation Marsilje, THPei, WChen, BLu, WUno, TJin, YJiang, TKim, SLi, NWarmuth, MSarkisova, YSun, FSteffy, APferdekamper, ACLi, AGJoseph, SBKim, YLiu, BTuntland, TCui, XGray, NSSteensma, RWan, YJiang, JChopiuk, GLi, JGordon, WPRichmond, WJohnson, KChang, JGroessl, THe, YQPhimister, AAycinena, ALee, CCBursulaya, BKaranewsky, DSSeidel, HMHarris, JLMichellys, PY Synthesis, structure-activity relationships, and in vivo efficacy of the novel potent and selective anaplastic lymphoma kinase (ALK) inhibitor 5-chloro-N2-(2-isopropoxy-5-methyl-4-(piperidin-4-yl)phenyl)-N4-(2-(isopropylsulfonyl)phenyl)pyrimidine-2,4-diamine (LDK378) currently in phase 1 and phase  J Med Chem56:5675-90 (2014) 
 
High affinity nerve growth factor receptor
Name:High affinity nerve growth factor receptor
Type:n/a
Mol. Mass.:87498.18
Organism:Homo sapiens (Human)
Description:P04629
Residue:796
BDBM50436850
NameBDBM50436850
Synonyms:CERITINIB LDK378 US10618884, Example 16 | US9809572, Example 16
TypeSmall organic molecule
Emp. Form.C28H36ClN5O3S
Mol. Mass.558.135
SMILESCC(C)Oc1cc(C2CCNCC2)c(C)cc1Nc1ncc(Cl)c(Nc2ccccc2S(=O)(=O)C(C)C)n1