Reaction Details
TargetP2Y purinoceptor 1
LigandBDBM50435829
Substrate/Competitorn/a
Meas. Tech.ChEMBL_971691 (CHEMBL2404230)
Ki 15±n/a nM
Citation Pi, ZSutton, JLloyd, JHua, JPrice, LWu, QChang, MZheng, JRehfuss, RHuang, CSWexler, RRLam, PY 2-Aminothiazole based P2Y(1) antagonists as novel antiplatelet agents. Bioorg Med Chem Lett23:4206-9 (2013) 
 
P2Y purinoceptor 1
Name:P2Y purinoceptor 1
Type:Enzyme
Mol. Mass.:42090.25
Organism:Homo sapiens (Human)
Description:P47900
Residue:373
BDBM50435829
NameBDBM50435829
Synonyms:CHEMBL2393211
TypeSmall organic molecule
Emp. Form.C24H23N3OS
Mol. Mass.401.524
SMILESCC(C)(C)c1ccccc1Oc1ncccc1Nc1ncc(s1)-c1ccccc1