Reaction Details
TargetSerine/threonine-protein kinase PAK 1
LigandBDBM50437034
Substrate/Competitorn/a
Meas. Tech.ChEMBL_971747 (CHEMBL2404583)
EC50 27700±n/a nM
Citation Xu, YFoulks, JMClifford, ABrenning, BLai, SLuo, BParnell, KMMerx, SMcCullar, MVKanner, SBHo, KK Synthesis and structure-activity relationship of 2-arylamino-4-aryl-pyrimidines as potent PAK1 inhibitors. Bioorg Med Chem Lett23:4072-5 (2013) 
 
Serine/threonine-protein kinase PAK 1
Name:Serine/threonine-protein kinase PAK 1
Type:n/a
Mol. Mass.:60640.15
Organism:Homo sapiens (Human)
Description:Q13153
Residue:545
BDBM50437034
NameBDBM50437034
Synonyms:CHEMBL2403071
TypeSmall organic molecule
Emp. Form.C24H22ClN7
Mol. Mass.443.931
SMILESCN1CCN(CC1)c1ccc(Nc2ncc(Cl)c(n2)-c2cccc(CC#N)c2)cc1C#N