Reaction Details
TargetFatty-acid amide hydrolase 1 [30-579]
LigandBDBM50437228
Substrate/Competitorn/a
Meas. Tech.ChEMBL_969749 (CHEMBL2404091)
IC50 1.6±n/a nM
Citation Moreno-Sanz, GDuranti, AMelzig, LFiorelli, CRuda, GFColombano, GMestichelli, PSanchini, STontini, AMor, MBandiera, TScarpelli, RTarzia, GPiomelli, D Synthesis and structure-activity relationship studies of O-biphenyl-3-yl carbamates as peripherally restricted fatty acid amide hydrolase inhibitors. J Med Chem56:5917-30 (2014) 
 
Fatty-acid amide hydrolase 1 [30-579]
Name:Fatty-acid amide hydrolase 1 [30-579]
Type:Single-pass membrane protein; homodimer
Mol. Mass.:60474.00
Organism:Rattus norvegicus (rat)
Description:P97612 (aa 30-579)
Residue:550
BDBM50437228
NameBDBM50437228
Synonyms:CHEMBL2402920
TypeSmall organic molecule
Emp. Form.C20H23NO4
Mol. Mass.341.4009
SMILESOCc1cccc(c1)-c1cc(OC(=O)NC2CCCCC2)ccc1O