Reaction Details
TargetDiacylglycerol O-acyltransferase 1
LigandBDBM50437393
Substrate/Competitorn/a
Meas. Tech.ChEMBL_972634 (CHEMBL2410614)
IC50 1.7±n/a nM
Citation He, SHong, QLai, ZWu, ZYu, YKim, DWTing, PCKuethe, JTYang, GXJian, TLiu, JGuiadeen, DKrikorian, ADSperbeck, DMSonatore, LMWiltsie, JChung, CCGibson, JTLisnock, JMurphy, BAGorski, JNLiu, JChen, DChen, XWolff, MTong, SXMadeira, MKaranam, BVShen, DMBalkovec, JMPinto, SNargund, RPDeVita, RJ Potent DGAT1 Inhibitors in the Benzimidazole Class with a Pyridyl-oxy-cyclohexanecarboxylic Acid Moiety. ACS Med Chem Lett4:773-8 (2013) 
 
Diacylglycerol O-acyltransferase 1
Name:Diacylglycerol O-acyltransferase 1
Type:Protein
Mol. Mass.:55297.82
Organism:Homo sapiens (Human)
Description:O75907
Residue:488
BDBM50437393
NameBDBM50437393
Synonyms:CHEMBL2408630
TypeSmall organic molecule
Emp. Form.C25H21F3N4O3
Mol. Mass.482.4544
SMILESOC(=O)[C@@H]1CC[C@@H](CC1)Oc1ccc(cn1)-c1ccc(cn1)-c1nc2ccc(cc2[nH]1)C(F)(F)F