Reaction Details
TargetDipeptidyl peptidase 4
LigandBDBM50228407
Substrate/Competitorn/a
Meas. Tech.ChEMBL_972637 (CHEMBL2410617)
IC50 0.73±n/a nM
Citation Czechtizky, WDedio, JDesai, BDixon, KFarrant, EFeng, QMorgan, TParry, DMRamjee, MKSelway, CNSchmidt, TTarver, GJWright, AG Integrated Synthesis and Testing of Substituted Xanthine Based DPP4 Inhibitors: Application to Drug Discovery. ACS Med Chem Lett4:768-72 (2013) 
 
Dipeptidyl peptidase 4
Name:Dipeptidyl peptidase 4
Type:Enzyme
Mol. Mass.:88235.21
Organism:Sus scrofa (pig)
Description:n/a
Residue:766
BDBM50228407
NameBDBM50228407
Synonyms:8-((R)-3-amino-piperidin-1-yl)-3-methyl-7-(3-methyl-but-2-enyl)-1-(2-oxo-2-phenyl-ethyl)-3,7-dihydro-purine-2,6-dione | CHEMBL237488
TypeSmall organic molecule
Emp. Form.C24H30N6O3
Mol. Mass.450.5334
SMILES[#6]\[#6](-[#6])=[#6]\[#6]-n1c(nc2n(-[#6])c(=O)n(-[#6]-[#6](=O)-c3ccccc3)c(=O)c12)-[#7]-1-[#6]-[#6]-[#6]-[#6@@H](-[#7])-[#6]-1