Reaction Details
TargetDipeptidyl peptidase 4
LigandBDBM50437395
Substrate/Competitorn/a
Meas. Tech.ChEMBL_972635 (CHEMBL2410615)
IC50 9.0±n/a nM
Citation Czechtizky, WDedio, JDesai, BDixon, KFarrant, EFeng, QMorgan, TParry, DMRamjee, MKSelway, CNSchmidt, TTarver, GJWright, AG Integrated Synthesis and Testing of Substituted Xanthine Based DPP4 Inhibitors: Application to Drug Discovery. ACS Med Chem Lett4:768-72 (2013) 
 
Dipeptidyl peptidase 4
Name:Dipeptidyl peptidase 4
Type:Enzyme
Mol. Mass.:88235.21
Organism:Sus scrofa (pig)
Description:n/a
Residue:766
BDBM50437395
NameBDBM50437395
Synonyms:CHEMBL2408638
TypeSmall organic molecule
Emp. Form.C24H31N5O4
Mol. Mass.453.534
SMILES[#6]\[#6](-[#6])=[#6]\[#6]-n1c(-[#8]-[#6]C([#6])([#6])[#6]-[#7])nc2n(-[#6])c(=O)n(-[#6]-[#6](=O)-c3ccccc3)c(=O)c12