Reaction Details
TargetHistone deacetylase 5
LigandBDBM19149
Substrate/Competitorn/a
Meas. Tech.ChEMBL_972658 (CHEMBL2410761)
IC50 27200±n/a nM
Citation Ko, KSSteffey, MEBrandvold, KRSoellner, MB Development of a chimeric c-Src kinase and HDAC inhibitor. ACS Med Chem Lett4:779-783 (2013) 
 
Histone deacetylase 5
Name:Histone deacetylase 5
Type:Enzyme
Mol. Mass.:121968.61
Organism:Homo sapiens (Human)
Description:Q9UQL6
Residue:1122
BDBM19149
NameBDBM19149
Synonyms:CHEMBL98 SAHA US10188756, Compound SAHA US11505523, Compound SAHA US9353061, SAHA US9695181, Vorinostat Zolinza suberoylanilide hydroxamic acid
TypeSmall organic molecule
Emp. Form.C14H20N2O3
Mol. Mass.264.3202
SMILESONC(=O)CCCCCCC(=O)Nc1ccccc1