Reaction Details
TargetHistone deacetylase 1
LigandBDBM50005014
Substrate/Competitorn/a
Meas. Tech.ChEMBL_972663 (CHEMBL2410766)
Ki 35±n/a nM
Citation Ko, KSSteffey, MEBrandvold, KRSoellner, MB Development of a chimeric c-Src kinase and HDAC inhibitor. ACS Med Chem Lett4:779-783 (2013) 
 
Histone deacetylase 1
Name:Histone deacetylase 1
Type:Enzyme
Mol. Mass.:55090.27
Organism:Homo sapiens (Human)
Description:Q13547
Residue:482
BDBM50005014
NameBDBM50005014
Synonyms:CHEMBL2408781
TypeSmall organic molecule
Emp. Form.C29H22ClN9O2
Mol. Mass.563.997
SMILESNc1ncnc2n(nc(-c3ccc(Cl)cc3)c12)-c1cccc(c1)-c1cnnn1Cc1ccc(\C=C\C(=O)NO)cc1