Reaction Details
TargetProto-oncogene tyrosine-protein kinase Src
LigandBDBM50005012
Substrate/Competitorn/a
Meas. Tech.ChEMBL_972667 (CHEMBL2410770)
Ki 371±n/a nM
Citation Ko, KSSteffey, MEBrandvold, KRSoellner, MB Development of a chimeric c-Src kinase and HDAC inhibitor. ACS Med Chem Lett4:779-783 (2013) 
 
Proto-oncogene tyrosine-protein kinase Src
Name:Proto-oncogene tyrosine-protein kinase Src
Type:Protein
Mol. Mass.:59838.60
Organism:Homo sapiens (Human)
Description:P12931
Residue:536
BDBM50005012
NameBDBM50005012
Synonyms:CHEMBL2408777
TypeSmall organic molecule
Emp. Form.C25H24ClN9O2
Mol. Mass.517.97
SMILESNc1ncnc2n(nc(-c3ccc(Cl)cc3)c12)-c1cccc(c1)-c1cn(CCCCCC(=O)NO)nn1