Reaction Details
TargetCoagulation factor VII
LigandBDBM50437440
Substrate/Competitorn/a
Meas. Tech.ChEMBL_974443 (CHEMBL2412515)
Ki 0.620000±n/a nM
Citation Priestley, ESDe Lucca, IZhou, JZhou, JSaiah, EStanton, RRobinson, LLuettgen, JMWei, AWen, XKnabb, RMWong, PCWexler, RR Discovery and gram-scale synthesis of BMS-593214, a potent, selective FVIIa inhibitor. Bioorg Med Chem Lett23:2432-5 (2013) 
 
Coagulation factor VII
Name:Coagulation factor VII
Type:Enzyme
Mol. Mass.:51599.89
Organism:Homo sapiens (Human)
Description:n/a
Residue:466
BDBM50437440
NameBDBM50437440
Synonyms:CHEMBL2409219
TypeSmall organic molecule
Emp. Form.C31H27N3O4
Mol. Mass.505.5638
SMILESCOc1cc([C@@H]2Nc3ccc(cc3[C@@H]3[C@H]2Cc2ccccc32)C(N)=N)c(cc1O)-c1ccccc1C(O)=O