Reaction Details
TargetAldo-keto reductase family 1 member B1 [K65Q]
LigandBDBM50437458
Substrate/Competitorn/a
Meas. Tech.ChEMBL_974577 (CHEMBL2410165)
IC50 1188±n/a nM
Citation Wang, QQCheng, NZheng, XWPeng, SMZou, XQ Synthesis of organic nitrates of luteolin as a novel class of potent aldose reductase inhibitors. Bioorg Med Chem21:4301-10 (2013) 
 
Aldo-keto reductase family 1 member B1 [K65Q]
Name:Aldo-keto reductase family 1 member B1 [K65Q]
Type:Protein
Mol. Mass.:35916.27
Organism:Bos taurus (Cattle)
Description:P16116[K65Q]
Residue:315
BDBM50437458
NameBDBM50437458
Synonyms:CHEMBL2409350
TypeSmall organic molecule
Emp. Form.C19H16O6
Mol. Mass.340.3267
SMILESCCOc1cc(O)c2c(c1)oc(cc2=O)-c1ccc2OCCOc2c1