Reaction Details
TargetAldo-keto reductase family 1 member B1 [K65Q]
LigandBDBM50437468
Substrate/Competitorn/a
Meas. Tech.ChEMBL_974577 (CHEMBL2410165)
IC50 168±n/a nM
Citation Wang, QQCheng, NZheng, XWPeng, SMZou, XQ Synthesis of organic nitrates of luteolin as a novel class of potent aldose reductase inhibitors. Bioorg Med Chem21:4301-10 (2013) 
 
Aldo-keto reductase family 1 member B1 [K65Q]
Name:Aldo-keto reductase family 1 member B1 [K65Q]
Type:Protein
Mol. Mass.:35916.27
Organism:Bos taurus (Cattle)
Description:P16116[K65Q]
Residue:315
BDBM50437468
NameBDBM50437468
Synonyms:CHEMBL2409465
TypeSmall organic molecule
Emp. Form.C17H13NO9
Mol. Mass.375.2864
SMILESOc1ccc(cc1O)-c1cc(=O)c2c(O)cc(OCCO[N+]([O-])=O)cc2o1