Reaction Details
TargetSerine/threonine-protein kinase B-raf
LigandBDBM50437505
Substrate/Competitorn/a
Meas. Tech.ChEMBL_974110 (CHEMBL2410833)
IC50>10000±n/a nM
Citation Oguro, YCary, DRMiyamoto, NTawada, MIwata, HMiki, HHori, AImamura, S Design, synthesis, and evaluation of novel VEGFR2 kinase inhibitors: discovery of [1,2,4]triazolo[1,5-a]pyridine derivatives with slow dissociation kinetics. Bioorg Med Chem21:4714-29 (2013) 
 
Serine/threonine-protein kinase B-raf
Name:Serine/threonine-protein kinase B-raf
Type:Serine/threonine-protein kinase
Mol. Mass.:84446.00
Organism:Homo sapiens (Human)
Description:P15056
Residue:766
BDBM50437505
NameBDBM50437505
Synonyms:CHEMBL2409778
TypeSmall organic molecule
Emp. Form.C22H20FN7O3
Mol. Mass.449.4377
SMILESCc1cc(C(=O)Nc2cc(Oc3ccc4nc(NC(=O)C5CC5)nn4c3)ccc2F)n(C)n1