Reaction Details
TargetAurora kinase A
LigandBDBM50437505
Substrate/Competitorn/a
Meas. Tech.ChEMBL_974112 (CHEMBL2410835)
IC50 2900±n/a nM
Citation Oguro, YCary, DRMiyamoto, NTawada, MIwata, HMiki, HHori, AImamura, S Design, synthesis, and evaluation of novel VEGFR2 kinase inhibitors: discovery of [1,2,4]triazolo[1,5-a]pyridine derivatives with slow dissociation kinetics. Bioorg Med Chem21:4714-29 (2013) 
 
Aurora kinase A
Name:Aurora kinase A
Type:Serine/threonine-protein kinase
Mol. Mass.:45830.98
Organism:Homo sapiens (Human)
Description:O14965
Residue:403
BDBM50437505
NameBDBM50437505
Synonyms:CHEMBL2409778
TypeSmall organic molecule
Emp. Form.C22H20FN7O3
Mol. Mass.449.4377
SMILESCc1cc(C(=O)Nc2cc(Oc3ccc4nc(NC(=O)C5CC5)nn4c3)ccc2F)n(C)n1