Reaction Details
TargetIntegrin alpha-4/beta-1
LigandBDBM50433575
Substrate/Competitorn/a
Meas. Tech.ChEMBL_974259 (CHEMBL2411537)
IC50 11±n/a nM
Citation Xu, YZSmith, JLSemko, CMRossiter, KIFukuda, JYDappen, MSQuincy, DAKonradi, AWMao, WWelch, BDreyer, MLSamant, BZhang, HLugar, JLiao, ZHenschel, CPetersen, EVandevert, CShoemaker, MWehner, NMutter, LShopp, GKrimm, MChen, LWipke, BDofiles, LGallager, ISauer, JMMessersmith, EKPleiss, MABard, FYednock, TA Orally available and efficaciousa4ß1/a4ß7 integrin inhibitors. Bioorg Med Chem Lett23:4370-3 (2013) 
 
Integrin alpha-4/beta-1
Name:Integrin alpha-4/beta-1
Type:n/a
Mol. Mass.:n/a
Description:ASSAY_ID of EBI is 88912
Components:This complex has 2 components.
Component 1
Name:Integrin beta-1
Synonyms:CD_antigen=CD29 Fibronectin receptor beta GPIIA ITGB1 MDF2 | MSK12
Type:Enzyme
Mol. Mass.:88400.38
Organism:Homo sapiens (Human)
Description:P05556
Residue:798
Component 2
Name:Integrin alpha-4
Synonyms:CD49 antigen-like family member D CD49d antigen ITA4_HUMAN Integrin alpha-4 Integrin alpha-IV VLA-4 integrin alpha 4 precursor | integrin alpha-4 precursor
Type:Membrane Protein
Mol. Mass.:114897.35
Organism:Homo sapiens (Human)
Description:P13612
Residue:1032
BDBM50433575
NameBDBM50433575
Synonyms:CHEMBL2381700
TypeSmall organic molecule
Emp. Form.C31H35FN6O6S
Mol. Mass.638.71
SMILESCCN(CC)c1ncc(N(CC#C)S(=O)(=O)c2ccc(F)cc2)c(N[C@@H](Cc2ccc(OC(=O)N3CCCC3)cc2)C(O)=O)n1