Reaction Details
TargetUbiquitin carboxyl-terminal hydrolase isozyme L1
LigandBDBM50437695
Substrate/Competitorn/a
Meas. Tech.ChEMBL_974327 (CHEMBL2411906)
IC50 3000±n/a nM
Citation Okada, KYe, YQTaniguchi, KYoshida, AAkiyama, TYoshioka, YOnose, JKoshino, HTakahashi, SYajima, AAbe, NYajima, S Vialinin A is a ubiquitin-specific peptidase inhibitor. Bioorg Med Chem Lett23:4328-31 (2013) 
 
Ubiquitin carboxyl-terminal hydrolase isozyme L1
Name:Ubiquitin carboxyl-terminal hydrolase isozyme L1
Type:PROTEIN
Mol. Mass.:24819.03
Organism:Homo sapiens (Human)
Description:ChEMBL_974327
Residue:223
BDBM50437695
NameBDBM50437695
Synonyms:CHEMBL1923233
TypeSmall organic molecule
Emp. Form.C19H18BrN3O
Mol. Mass.384.27
SMILESCCC[C@H](NC(=O)C(=C\c1cccc(Br)n1)\C#N)c1ccccc1