Reaction Details
TargetProbable ubiquitin carboxyl-terminal hydrolase FAF-X
LigandBDBM50437695
Substrate/Competitorn/a
Meas. Tech.ChEMBL_974328 (CHEMBL2411907)
IC50 3000±n/a nM
Citation Okada, KYe, YQTaniguchi, KYoshida, AAkiyama, TYoshioka, YOnose, JKoshino, HTakahashi, SYajima, AAbe, NYajima, S Vialinin A is a ubiquitin-specific peptidase inhibitor. Bioorg Med Chem Lett23:4328-31 (2013) 
 
Probable ubiquitin carboxyl-terminal hydrolase FAF-X
Name:Probable ubiquitin carboxyl-terminal hydrolase FAF-X
Type:PROTEIN
Mol. Mass.:292239.69
Organism:Homo sapiens (Human)
Description:ChEMBL_107634
Residue:2570
BDBM50437695
NameBDBM50437695
Synonyms:CHEMBL1923233
TypeSmall organic molecule
Emp. Form.C19H18BrN3O
Mol. Mass.384.27
SMILESCCC[C@H](NC(=O)C(=C\c1cccc(Br)n1)\C#N)c1ccccc1