Reaction Details
TargetPeptidyl-prolyl cis-trans isomerase NIMA-interacting 1
LigandBDBM50437706
Substrate/Competitorn/a
Meas. Tech.ChEMBL_974636 (CHEMBL2410562)
IC50 5600±n/a nM
Citation Moore, JDPotter, A Pin1 inhibitors: Pitfalls, progress and cellular pharmacology. Bioorg Med Chem Lett23:4283-91 (2013) 
 
Peptidyl-prolyl cis-trans isomerase NIMA-interacting 1
Name:Peptidyl-prolyl cis-trans isomerase NIMA-interacting 1
Type:PROTEIN
Mol. Mass.:18248.11
Organism:Homo sapiens (Human)
Description:ChEMBL_1502595
Residue:163
BDBM50437706
NameBDBM50437706
Synonyms:CHEMBL2409071
TypeSmall organic molecule
Emp. Form.C18H17FO2
Mol. Mass.284.3248
SMILESCOc1ccc(F)cc1C(=O)[C@]1(C)CCc2ccccc12