Reaction Details
TargetPeptidyl-prolyl cis-trans isomerase NIMA-interacting 1
LigandBDBM50437704
Substrate/Competitorn/a
Meas. Tech.ChEMBL_974636 (CHEMBL2410562)
IC50 4000±n/a nM
Citation Moore, JDPotter, A Pin1 inhibitors: Pitfalls, progress and cellular pharmacology. Bioorg Med Chem Lett23:4283-91 (2013) 
 
Peptidyl-prolyl cis-trans isomerase NIMA-interacting 1
Name:Peptidyl-prolyl cis-trans isomerase NIMA-interacting 1
Type:PROTEIN
Mol. Mass.:18248.11
Organism:Homo sapiens (Human)
Description:ChEMBL_1502595
Residue:163
BDBM50437704
NameBDBM50437704
Synonyms:CHEMBL2409078
TypeSmall organic molecule
Emp. Form.C12H20N2S3
Mol. Mass.288.496
SMILESS=C(SC(=S)N1CCCCC1)N1CCCCC1