Reaction Details
TargetVesicular acetylcholine transporter
LigandBDBM50292907
Substrate/Competitorn/a
Meas. Tech.ChEMBL_973123 (CHEMBL2412886)
Ki 2.7±n/a nM
Citation Li, JZhang, XZhang, ZPadakanti, PKJin, HCui, JLi, AZeng, DRath, NPFlores, HPerlmutter, JSParsons, SMTu, Z Heteroaromatic and aniline derivatives of piperidines as potent ligands for vesicular acetylcholine transporter. J Med Chem56:6216-33 (2013) 
 
Vesicular acetylcholine transporter
Name:Vesicular acetylcholine transporter
Type:PROTEIN
Mol. Mass.:56900.67
Organism:Homo sapiens (Human)
Description:ChEMBL_1507628
Residue:532
BDBM50292907
NameBDBM50292907
Synonyms:(+)-trans-(4-fluorophenyl)(1-(3-hydroxy-1,2,3,4-tetrahydronaphthalen-2-yl)piperidin-4-yl)methanone (-)-trans(4-fluorophenyl)(1-(3-hydroxy-1,2,3,4-tetrahydronaphthalen-2-yl)piperidin-4-yl)methanone | CHEMBL473129
TypeSmall organic molecule
Emp. Form.C22H24FNO2
Mol. Mass.353.4299
SMILESO[C@@H]1Cc2ccccc2C[C@H]1N1CCC(CC1)C(=O)c1ccc(F)cc1