Reaction Details
TargetDiacylglycerol O-acyltransferase 1
LigandBDBM50355142
Substrate/Competitorn/a
Meas. Tech.ChEMBL_973379 (CHEMBL2410085)
IC50 88±n/a nM
Citation Kwak, HJPyun, YMKim, JYPagire, HSKim, KYKim, KRRhee, SDJung, WHSong, JSBae, MALee, DHAhn, JH Synthesis and biological evaluation of aminobenzimidazole derivatives with a phenylcyclohexyl acetic acid group as anti-obesity and anti-diabetic agents. Bioorg Med Chem Lett23:4713-8 (2013) 
 
Diacylglycerol O-acyltransferase 1
Name:Diacylglycerol O-acyltransferase 1
Type:Enzyme
Mol. Mass.:56810.61
Organism:Mus musculus (mouse)
Description:In this assay, recombinant mouse DGAT-1 containing an N-terminal His6-epitope tag was produced in the baculovirus expression system.
Residue:498
BDBM50355142
NameBDBM50355142
Synonyms:CHEMBL1835919
TypeSmall organic molecule
Emp. Form.C21H24N4O4
Mol. Mass.396.4397
SMILESNc1ncnc2OCCN(c3ccc(cc3)[C@H]3CC[C@H](CC(O)=O)CC3)C(=O)c12