Reaction Details
TargetNuclear receptor corepressor 1
LigandBDBM50437813
Substrate/Competitorn/a
Meas. Tech.ChEMBL_973950 (CHEMBL2410097)
IC50 23±n/a nM
Citation Marson, CMMatthews, CJYiannaki, EAtkinson, SJSoden, PEShukla, LLamadema, NThomas, NS Discovery of potent, isoform-selective inhibitors of histone deacetylase containing chiral heterocyclic capping groups and a N-(2-aminophenyl)benzamide binding unit. J Med Chem56:6156-74 (2013) 
 
Nuclear receptor corepressor 1
Name:Nuclear receptor corepressor 1
Type:PROTEIN
Mol. Mass.:270226.27
Organism:Homo sapiens (Human)
Description:ChEMBL_107910
Residue:2440
BDBM50437813
NameBDBM50437813
Synonyms:CHEMBL2407722
TypeSmall organic molecule
Emp. Form.C23H22N4OS
Mol. Mass.402.512
SMILESNc1ccccc1NC(=O)c1ccc(CN=C2NC[C@H](S2)c2ccccc2)cc1