Reaction Details
TargetNuclear receptor corepressor 1
LigandBDBM50437815
Substrate/Competitorn/a
Meas. Tech.ChEMBL_973950 (CHEMBL2410097)
IC50 52±n/a nM
Citation Marson, CMMatthews, CJYiannaki, EAtkinson, SJSoden, PEShukla, LLamadema, NThomas, NS Discovery of potent, isoform-selective inhibitors of histone deacetylase containing chiral heterocyclic capping groups and a N-(2-aminophenyl)benzamide binding unit. J Med Chem56:6156-74 (2013) 
 
Nuclear receptor corepressor 1
Name:Nuclear receptor corepressor 1
Type:PROTEIN
Mol. Mass.:270226.27
Organism:Homo sapiens (Human)
Description:ChEMBL_107910
Residue:2440
BDBM50437815
NameBDBM50437815
Synonyms:CHEMBL2407720
TypeSmall organic molecule
Emp. Form.C24H24N4OS
Mol. Mass.416.539
SMILESNc1ccccc1NC(=O)c1ccc(CN=C2N[C@@H](Cc3ccccc3)CS2)cc1