Reaction Details
TargetNuclear receptor corepressor 1
LigandBDBM50437816
Substrate/Competitorn/a
Meas. Tech.ChEMBL_973950 (CHEMBL2410097)
IC50 16±n/a nM
Citation Marson, CMMatthews, CJYiannaki, EAtkinson, SJSoden, PEShukla, LLamadema, NThomas, NS Discovery of potent, isoform-selective inhibitors of histone deacetylase containing chiral heterocyclic capping groups and a N-(2-aminophenyl)benzamide binding unit. J Med Chem56:6156-74 (2013) 
 
Nuclear receptor corepressor 1
Name:Nuclear receptor corepressor 1
Type:PROTEIN
Mol. Mass.:270226.27
Organism:Homo sapiens (Human)
Description:ChEMBL_107910
Residue:2440
BDBM50437816
NameBDBM50437816
Synonyms:CHEMBL2407719
TypeSmall organic molecule
Emp. Form.C23H22N4O2S
Mol. Mass.418.511
SMILESNc1ccccc1NC(=O)c1ccc(CN=C2N[C@H](CS2)c2ccc(O)cc2)cc1