Reaction Details
TargetNuclear receptor corepressor 1
LigandBDBM50437818
Substrate/Competitorn/a
Meas. Tech.ChEMBL_973950 (CHEMBL2410097)
IC50 63±n/a nM
Citation Marson, CMMatthews, CJYiannaki, EAtkinson, SJSoden, PEShukla, LLamadema, NThomas, NS Discovery of potent, isoform-selective inhibitors of histone deacetylase containing chiral heterocyclic capping groups and a N-(2-aminophenyl)benzamide binding unit. J Med Chem56:6156-74 (2013) 
 
Nuclear receptor corepressor 1
Name:Nuclear receptor corepressor 1
Type:PROTEIN
Mol. Mass.:270226.27
Organism:Homo sapiens (Human)
Description:ChEMBL_107910
Residue:2440
BDBM50437818
NameBDBM50437818
Synonyms:CHEMBL2407716
TypeSmall organic molecule
Emp. Form.C23H21N3OS2
Mol. Mass.419.562
SMILESNc1ccccc1NC(=O)c1ccc(CSC2=N[C@H](CS2)c2ccccc2)cc1