Reaction Details
TargetNuclear receptor corepressor 1
LigandBDBM50437829
Substrate/Competitorn/a
Meas. Tech.ChEMBL_973950 (CHEMBL2410097)
IC50>20000±n/a nM
Citation Marson, CMMatthews, CJYiannaki, EAtkinson, SJSoden, PEShukla, LLamadema, NThomas, NS Discovery of potent, isoform-selective inhibitors of histone deacetylase containing chiral heterocyclic capping groups and a N-(2-aminophenyl)benzamide binding unit. J Med Chem56:6156-74 (2013) 
 
Nuclear receptor corepressor 1
Name:Nuclear receptor corepressor 1
Type:PROTEIN
Mol. Mass.:270226.27
Organism:Homo sapiens (Human)
Description:ChEMBL_107910
Residue:2440
BDBM50437829
NameBDBM50437829
Synonyms:CHEMBL2407728
TypeSmall organic molecule
Emp. Form.C31H26N6O3
Mol. Mass.530.5765
SMILESNc1cc(ccc1NC(=O)c1ccc(CNc2nccc(n2)-c2cccnc2)cc1)C(=O)OCc1ccccc1