Reaction Details
TargetCytochrome P450 1A2
LigandBDBM50437837
Substrate/Competitorn/a
Meas. Tech.ChEMBL_973972 (CHEMBL2410119)
IC50>10000±n/a nM
Citation Laufer, RForrest, BLi, SWLiu, YSampson, PEdwards, LLang, YAwrey, DEMao, GPlotnikova, OLeung, GHodgson, RBeletskaya, IMason, JMLuo, XWei, XYao, YFeher, MBan, FKiarash, RGreen, EMak, TWPan, GPauls, HW The discovery of PLK4 inhibitors: (E)-3-((1H-Indazol-6-yl)methylene)indolin-2-ones as novel antiproliferative agents. J Med Chem56:6069-87 (2013) 
 
Cytochrome P450 1A2
Name:Cytochrome P450 1A2
Type:Enzyme
Mol. Mass.:58423.38
Organism:Homo sapiens (Human)
Description:P05177
Residue:516
BDBM50437837
NameBDBM50437837
Synonyms:CHEMBL2407897
TypeSmall organic molecule
Emp. Form.C27H24N4O
Mol. Mass.420.5057
SMILESCN(C)Cc1ccc(\C=C\c2n[nH]c3cc(\C=C4\C(=O)Nc5ccccc45)ccc23)cc1